Reaction Details
TargetMelatonin receptor type 1A
LigandBDBM29611
Substrate/Competitorn/a
Ki 0.04±n/a nM
CommentsPDSP_1192
Citation Beresford, IJBrowning, CStarkey, SJBrown, JFoord, SMCoughlan, JNorth, PCDubocovich, MLHagan, RM GR196429: a nonindolic agonist at high-affinity melatonin receptors. J Pharmacol Exp Ther285:1239-45 (1998) Melatonin receptor type 1A
Name:Melatonin receptor type 1A
Type:Enzyme Catalytic Domain
Mol. Mass.:17908.30
Organism:GUINEA PIG
Description:Melatonin 0 GUINEA PIG::O02781
Residue:154
BDBM29611
NameBDBM29611
Synonyms:2-Iodomelatonin Melatonin,2-Iodo
TypeSmall organic molecule
Emp. Form.C13H15IN2O2
Mol. Mass.358.1749
SMILESCOc1ccc2[nH]c(I)c(CCNC(C)=O)c2c1