Reaction Details
TargetMelatonin receptor type 1A
LigandBDBM50043289
Substrate/Competitorn/a
Ki 0.74±n/a nM
CommentsPDSP_1195
Citation Beresford, IJBrowning, CStarkey, SJBrown, JFoord, SMCoughlan, JNorth, PCDubocovich, MLHagan, RM GR196429: a nonindolic agonist at high-affinity melatonin receptors. J Pharmacol Exp Ther285:1239-45 (1998) Melatonin receptor type 1A
Name:Melatonin receptor type 1A
Type:Enzyme Catalytic Domain
Mol. Mass.:17908.30
Organism:GUINEA PIG
Description:Melatonin 0 GUINEA PIG::O02781
Residue:154
BDBM50043289
NameBDBM50043289
Synonyms:CHEMBL34730 N-[2-(6-Chloro-5-methoxy-1H-indol-3-yl)-ethyl]-acetamide(6-Chloromelatonin) | melatonin, 6-Chloro
TypeSmall organic molecule
Emp. Form.C13H15ClN2O2
Mol. Mass.266.723
SMILESCOc1cc2c(CCNC(C)=O)c[nH]c2cc1Cl