Reaction Details
TargetMelatonin receptor type 1A
LigandBDBM85238
Substrate/Competitorn/a
Ki 0.46±n/a nM
CommentsPDSP_175
Citation Sugden, DPickering, HTeh, MTGarratt, PJ Melatonin receptor pharmacology: toward subtype specificity. Biol Cell89:531-7 (1997) 
 
Melatonin receptor type 1A
Name:Melatonin receptor type 1A
Type:Enzyme
Mol. Mass.:39392.94
Organism:Homo sapiens (Human)
Description:P48039
Residue:350
BDBM85238
NameBDBM85238
Synonyms:5-MeOT-N-butanyl
TypeSmall organic molecule
Emp. Form.C18H25N3O2
Mol. Mass.315.41
SMILESCCCC(=O)NCCc1ccc2[nH]cc(CCNC(C)=O)c2c1