Reaction Details
TargetMelatonin receptor type 1B
LigandBDBM85240
Substrate/Competitorn/a
Ki 8.1±n/a nM
CommentsPDSP_177
Citation Sugden, DPickering, HTeh, MTGarratt, PJ Melatonin receptor pharmacology: toward subtype specificity. Biol Cell89:531-7 (1997) 
 
Melatonin receptor type 1B
Name:Melatonin receptor type 1B
Type:Enzyme
Mol. Mass.:40203.54
Organism:Homo sapiens (Human)
Description:P49286
Residue:362
BDBM85240
NameBDBM85240
Synonyms:5-MeOT-N-pentanyl
TypeSmall organic molecule
Emp. Form.C19H27N3O2
Mol. Mass.329.4366
SMILESCCCCC(=O)NCCc1ccc2[nH]cc(CCNC(C)=O)c2c1