Reaction Details
TargetMelatonin receptor type 1B
LigandBDBM9019
Substrate/Competitorn/a
Ki 0.48±n/a nM
CommentsPDSP_1189
Citation Sugden, DPickering, HTeh, MTGarratt, PJ Melatonin receptor pharmacology: toward subtype specificity. Biol Cell89:531-7 (1997) 
 
Melatonin receptor type 1B
Name:Melatonin receptor type 1B
Type:Enzyme
Mol. Mass.:40203.54
Organism:Homo sapiens (Human)
Description:P49286
Residue:362
BDBM9019
NameBDBM9019
Synonyms:CHEMBL45 N-[2-(5-methoxy-1H-indol-3-yl)ethyl]acetamide
TypeSmall organic molecule
Emp. Form.C13H16N2O2
Mol. Mass.232.2783
SMILESCOc1ccc2[nH]cc(CCNC(C)=O)c2c1