Reaction Details
TargetMelatonin receptor type 1B
LigandBDBM85236
Substrate/Competitorn/a
Ki 0.22±n/a nM
CommentsPDSP_1191
Citation Sugden, DPickering, HTeh, MTGarratt, PJ Melatonin receptor pharmacology: toward subtype specificity. Biol Cell89:531-7 (1997) 
 
Melatonin receptor type 1B
Name:Melatonin receptor type 1B
Type:Enzyme
Mol. Mass.:40203.54
Organism:Homo sapiens (Human)
Description:P49286
Residue:362
BDBM85236
NameBDBM85236
Synonyms:Melatonin,2-Chloro
TypeSmall organic molecule
Emp. Form.C13H15ClN2O2
Mol. Mass.266.723
SMILESCOc1ccc2[nH]c(Cl)c(CCNC(C)=O)c2c1