Reaction Details
TargetProstaglandin G/H synthase 2
LigandBDBM26197
Substrate/Competitorn/a
Ki>10000±n/a nM
CommentsPDSP_4486
Citation Cryer, BFeldman, M Cyclooxygenase-1 and cyclooxygenase-2 selectivity of widely used nonsteroidal anti-inflammatory drugs. Am J Med104:413-21 (1998) 
 
Prostaglandin G/H synthase 2
Name:Prostaglandin G/H synthase 2
Type:Enzyme
Mol. Mass.:69003.89
Organism:Homo sapiens (Human)
Description:Recombinant Cox-2 provided by Cayman (Cayman Chemical Co.,Ann Arbor, MI).
Residue:604
BDBM26197
NameBDBM26197
Synonyms:CHEMBL112 Norco US9333197, Acetaminophen phenol derivative, 11
TypeSmall organic molecule
Emp. Form.C8H9NO2
Mol. Mass.151.1626
SMILESCC(=O)Nc1ccc(O)cc1