Reaction Details
TargetProstaglandin G/H synthase 2
LigandBDBM50174201
Substrate/Competitorn/a
Ki 10±n/a nM
CommentsPDSP_3988
Citation Cryer, BFeldman, M Cyclooxygenase-1 and cyclooxygenase-2 selectivity of widely used nonsteroidal anti-inflammatory drugs. Am J Med104:413-21 (1998) 
 
Prostaglandin G/H synthase 2
Name:Prostaglandin G/H synthase 2
Type:Enzyme
Mol. Mass.:69003.89
Organism:Homo sapiens (Human)
Description:Recombinant Cox-2 provided by Cayman (Cayman Chemical Co.,Ann Arbor, MI).
Residue:604
BDBM50174201
NameBDBM50174201
Synonyms:ARTHROTEC SOLARAZE US11173137, Compound Diclofenac VOLTAREN-XR sodium 2-(2-(2,6-dichlorophenylamino)phenyl)acetate
TypeSmall organic molecule
Emp. Form.C14H10Cl2NO2
Mol. Mass.295.141
SMILES[O-]C(=O)Cc1ccccc1Nc1c(Cl)cccc1Cl