Reaction Details
TargetProstaglandin G/H synthase 2
LigandBDBM50134036
Substrate/Competitorn/a
Ki 160±n/a nM
CommentsPDSP_4460
Citation Cryer, BFeldman, M Cyclooxygenase-1 and cyclooxygenase-2 selectivity of widely used nonsteroidal anti-inflammatory drugs. Am J Med104:413-21 (1998) 
 
Prostaglandin G/H synthase 2
Name:Prostaglandin G/H synthase 2
Type:Enzyme
Mol. Mass.:69003.89
Organism:Homo sapiens (Human)
Description:Recombinant Cox-2 provided by Cayman (Cayman Chemical Co.,Ann Arbor, MI).
Residue:604
BDBM50134036
NameBDBM50134036
Synonyms:2-(2,3-Dimethyl-phenylamino)-benzoic acid 2-(2,3-dimethylphenylamino)benzoic acid CI-473 INF-3355 Ponstel mefanamic acid
TypeSmall organic molecule
Emp. Form.C15H15NO2
Mol. Mass.241.2851
SMILESCc1cccc(Nc2ccccc2C(O)=O)c1C