Reaction Details
TargetProstaglandin G/H synthase 2
LigandBDBM50295287
Substrate/Competitorn/a
Ki 2250±n/a nM
CommentsPDSP_4465
Citation Cryer, BFeldman, M Cyclooxygenase-1 and cyclooxygenase-2 selectivity of widely used nonsteroidal anti-inflammatory drugs. Am J Med104:413-21 (1998) 
 
Prostaglandin G/H synthase 2
Name:Prostaglandin G/H synthase 2
Type:Enzyme
Mol. Mass.:69003.89
Organism:Homo sapiens (Human)
Description:Recombinant Cox-2 provided by Cayman (Cayman Chemical Co.,Ann Arbor, MI).
Residue:604
BDBM50295287
NameBDBM50295287
Synonyms:2-(1-methyl-5-(4-methylbenzoyl)-1H-pyrrol-2-yl)acetic acid MCN-2559 Tolectin [1-Methyl-5-(4-methyl-benzoyl)-1H-pyrrol-2-yl]-acetic acid(tolmetin)
TypeSmall organic molecule
Emp. Form.C15H15NO3
Mol. Mass.257.2845
SMILESCc1ccc(cc1)C(=O)c1ccc(CC(O)=O)n1C