Reaction Details
TargetProstaglandin G/H synthase 2
LigandBDBM85243
Substrate/Competitorn/a
Ki 40±n/a nM
CommentsPDSP_3986
Citation Cryer, BFeldman, M Cyclooxygenase-1 and cyclooxygenase-2 selectivity of widely used nonsteroidal anti-inflammatory drugs. Am J Med104:413-21 (1998) 
 
Prostaglandin G/H synthase 2
Name:Prostaglandin G/H synthase 2
Type:Enzyme
Mol. Mass.:69003.89
Organism:Homo sapiens (Human)
Description:Recombinant Cox-2 provided by Cayman (Cayman Chemical Co.,Ann Arbor, MI).
Residue:604
BDBM85243
NameBDBM85243
Synonyms:2-VALERYLOXYBENZOIC ACID valeryl salicylate
TypeSmall organic molecule
Emp. Form.C12H14O4
Mol. Mass.222.2372
SMILESCCCCC(=O)Oc1ccccc1C(O)=O