Reaction Details
TargetUDP-N-acetylmuramoyl-tripeptide--D-alanyl-D-alanine ligase
LigandBDBM85277
Substrate/Competitorn/a
Meas. Tech.Enzymatic Assay
pH8±0
Temperature310.15±0 K
IC50 1.50e+5±n/a nM
Citation Sova, MKovac, ATurk, SHrast, MBlanot, DGobec, S Phosphorylated hydroxyethylamines as novel inhibitors of the bacterial cell wall biosynthesis enzymes MurC to MurF. Bioorg Chem37:217-22 (2009) 
 
UDP-N-acetylmuramoyl-tripeptide--D-alanyl-D-alanine ligase
Name:UDP-N-acetylmuramoyl-tripeptide--D-alanyl-D-alanine ligase
Type:Protein
Mol. Mass.:47439.03
Organism:Escherichia coli
Description:P11880
Residue:452
BDBM85277
NameBDBM85277
Synonyms:HEA derivative, 7d
TypeSmall organic molecule
Emp. Form.C14H20F3N2O7PS
Mol. Mass.448.352
SMILESOP(O)(=O)OC(CNS(=O)(=O)c1cccc(c1)C(F)(F)F)CN1CCOCC1