Reaction Details
TargetGlutamine synthetase
LigandBDBM85288
Substrate/Competitorn/a
Meas. Tech.Enzyme Assay
pH7±0
Ki 0.22±0.05 nM
Citation Johnson, RCBoettcher, BRCherpeck, REDolson, MG Design and Synthesis of Potent Inhibitors of Glutamine Synthetase Bioorg Chem18:154-9 (1990)  
 
Glutamine synthetase
Name:Glutamine synthetase
Type:Protein
Mol. Mass.:42066.51
Organism:Homo sapiens (Human)
Description:P15104
Residue:373
BDBM85288
NameBDBM85288
Synonyms:Phosphinothricin analog, 1 (L Isomer)
TypeSmall organic molecule
Emp. Form.C5H11NO4P
Mol. Mass.180.1195
SMILESCP([O-])(=O)CCC([NH3+])C([O-])=O