Reaction Details
TargetGlutamine synthetase
LigandBDBM85291
Substrate/Competitorn/a
Meas. Tech.Enzyme Assay
pH7±0
Ki 0.47±0.12 nM
Citation Johnson, RCBoettcher, BRCherpeck, REDolson, MG Design and Synthesis of Potent Inhibitors of Glutamine Synthetase Bioorg Chem18:154-9 (1990)  
 
Glutamine synthetase
Name:Glutamine synthetase
Type:Protein
Mol. Mass.:42066.51
Organism:Homo sapiens (Human)
Description:P15104
Residue:373
BDBM85291
NameBDBM85291
Synonyms:Phosphinothricin analog, 4 (D,L Isomer)
TypeSmall organic molecule
Emp. Form.C7H13NO4P
Mol. Mass.206.1567
SMILESCP(O)([O-])C1=C[C@]([NH3+])(CC1)C([O-])=O