Reaction Details
TargetGlutamine--fructose-6-phosphate aminotransferase [isomerizing]
LigandBDBM85314
Substrate/Competitorn/a
Meas. Tech.Enzyme Assay
pH6.85±0
Ki 4400000±0.0 nM
IC50 7800000±0.0 nM
Citation Milewski, SHoffmann, MAndruszkiewicz, RBorowski, E Investigation of Mechanism of Nitrogen Transfer in Glucosamine 6-Phosphate Synthase with the Use of Transition State Analogs Bioorg Chem25:283-296 (1997)  
 
Glutamine--fructose-6-phosphate aminotransferase [isomerizing]
Name:Glutamine--fructose-6-phosphate aminotransferase [isomerizing]
Type:Enzyme
Mol. Mass.:79262.13
Organism:Candida albicans
Description:P53704
Residue:713
BDBM85314
NameBDBM85314
Synonyms:GlcN-6-P synthase inhibitor, 7 (racemic mixture)
TypeSmall organic molecule
Emp. Form.C8H19N2O4P
Mol. Mass.238.2212
SMILESCCNP(=O)(CCC(N)C(=O)OC)OC