Reaction Details
TargetGlutamine--fructose-6-phosphate aminotransferase [isomerizing]
LigandBDBM85321
Substrate/Competitorn/a
Meas. Tech.Enzyme Assay
pH6.85±0
Ki 2800000±0.0 nM
IC50 5500000±0.0 nM
Citation Milewski, SHoffmann, MAndruszkiewicz, RBorowski, E Investigation of Mechanism of Nitrogen Transfer in Glucosamine 6-Phosphate Synthase with the Use of Transition State Analogs Bioorg Chem25:283-296 (1997)  
 
Glutamine--fructose-6-phosphate aminotransferase [isomerizing]
Name:Glutamine--fructose-6-phosphate aminotransferase [isomerizing]
Type:Enzyme
Mol. Mass.:79262.13
Organism:Candida albicans
Description:P53704
Residue:713
BDBM85321
NameBDBM85321
Synonyms:GlcN-6-P synthase inhibitor, 14 (racemic mixture)
TypeSmall organic molecule
Emp. Form.C5H12N2O4S
Mol. Mass.196.225
SMILESCOC(=O)C(N)CCS(N)(=O)=O