Reaction Details
TargetSomatostatin receptor type 2
LigandBDBM82253
Substrate/Competitorn/a
Ki 2.81±n/a nM
CommentsPDSP_382
Citation Siehler, SSeuwen, KHoyer, D [125I][Tyr3]octreotide labels human somatostatin sst2 and sst5 receptors. Eur J Pharmacol348:311-20 (1998) 
 
Somatostatin receptor type 2
Name:Somatostatin receptor type 2
Type:Enzyme
Mol. Mass.:41344.94
Organism:Homo sapiens (Human)
Description:P30874
Residue:369
BDBM82253
NameBDBM82253
Synonyms:BIM 23052 | CAS_133073-82-2
TypeSmall organic molecule
Emp. Form.C61H75N11O10
Mol. Mass.1122.3159
SMILESC[C@@H](O)[C@H](NC(=O)[C@H](Cc1ccccc1)NC(=O)[C@@H](NC(=O)[C@H](CCCCN)NC(=O)[C@@H](Cc1c[nH]c2ccccc12)NC(=O)[C@H](Cc1ccccc1)NC(=O)[C@H](Cc1ccccc1)NC(=O)[C@H](N)Cc1ccccc1)[C@@H](C)O)C(N)=O