Reaction Details
TargetAlpha-1B adrenergic receptor
LigandBDBM50030614
Substrate/Competitorn/a
Ki 25.12±n/a nM
CommentsPDSP_1717
Citation Wikberg-Matsson, AWikberg, JEUhlén, S Characterization of alpha1-adrenoceptor subtypes in the pig. Eur J Pharmacol347:301-9 (1998) 
 
Alpha-1B adrenergic receptor
Name:Alpha-1B adrenergic receptor
Type:Enzyme Catalytic Domain
Mol. Mass.:34826.67
Organism:PIG
Description:Q70HQ0
Residue:316
BDBM50030614
NameBDBM50030614
Synonyms:5-Chloro-8-methyl-1-vinyl-6,7,8,9-tetrahydro-2-thia-8-aza-benzo[cd]azulene SK&F-104856 SKF 104856
TypeSmall organic molecule
Emp. Form.C14H14ClNS
Mol. Mass.263.786
SMILESCN1CCc2c(Cl)ccc3sc(C=C)c(C1)c23