Reaction Details
TargetAlpha-1B adrenergic receptor
LigandBDBM21397
Substrate/Competitorn/a
Ki 5.01±n/a nM
CommentsPDSP_1739
Citation Wikberg-Matsson, AWikberg, JEUhlén, S Characterization of alpha1-adrenoceptor subtypes in the pig. Eur J Pharmacol347:301-9 (1998) 
 
Alpha-1B adrenergic receptor
Name:Alpha-1B adrenergic receptor
Type:Enzyme Catalytic Domain
Mol. Mass.:34826.67
Organism:PIG
Description:Q70HQ0
Residue:316
BDBM21397
NameBDBM21397
Synonyms:8-[4-(4-fluorophenyl)-4-keto-butyl]-1-phenyl-1,3,8-triazaspiro[4.5]decan-4-one 8-[4-(4-fluorophenyl)-4-oxobutyl]-1-phenyl-1,3,8-triazaspiro[4.5]decan-4-one MLS000028615 SPIPERONE US9359372, Spiperone cid_5265
Typeradiolabeled ligand
Emp. Form.C23H26FN3O2
Mol. Mass.395.4698
SMILESFc1ccc(cc1)C(=O)CCCN1CCC2(CC1)N(CNC2=O)c1ccccc1