Reaction Details
Target5-hydroxytryptamine receptor 2A
LigandBDBM50241143
Substrate/Competitorn/a
Ki 2852±n/a nM
CommentsPDSP_1179
Citation Toll, LBerzetei-Gurske, IPPolgar, WEBrandt, SRAdapa, IDRodriguez, LSchwartz, RWHaggart, DO'Brien, AWhite, AKennedy, JMCraymer, KFarrington, LAuh, JS Standard binding and functional assays related to medications development division testing for potential cocaine and opiate narcotic treatment medications. NIDA Res Monogr178:440-66 (1998) 5-hydroxytryptamine receptor 2A
Name:5-hydroxytryptamine receptor 2A
Type:G Protein-Coupled Receptor (GPCR)
Mol. Mass.:52852.05
Organism:Rattus norvegicus (rat)
Description:Rat cortex membranes 5-HT2A receptors.
Residue:471
BDBM50241143
NameBDBM50241143
Synonyms:(MDL 72222)3,5-Dichloro-benzoic acid 8-methyl-8-aza-bicyclo[3.2.1]oct-3-yl ester 3,5-Dichloro-benzoic acid 8-methyl-8-aza-bicyclo[3.2.1]oct-3-yl ester (MDL 72222) 3,5-Dichloro-benzoic acid 8-methyl-8-aza-bicyclo[3.2.1]oct-3-yl ester(MDL-72222) 3alpha-(3',5'-dichlorobenzoyloxy)tropane MDL 72222 [2-(5-Hydroxy-1H-indol-3-yl)-ethyl]-trimethyl-ammonium
TypeSmall organic molecule
Emp. Form.C15H17Cl2NO2
Mol. Mass.314.207
SMILESCN1C2CCC1CC(C2)OC(=O)c1cc(Cl)cc(Cl)c1