Reaction Details
Target5-hydroxytryptamine receptor 2A
LigandBDBM50004918
Substrate/Competitorn/a
Ki 2700±n/a nM
CommentsPDSP_1722
Citation Toll, LBerzetei-Gurske, IPPolgar, WEBrandt, SRAdapa, IDRodriguez, LSchwartz, RWHaggart, DO'Brien, AWhite, AKennedy, JMCraymer, KFarrington, LAuh, JS Standard binding and functional assays related to medications development division testing for potential cocaine and opiate narcotic treatment medications. NIDA Res Monogr178:440-66 (1998) 5-hydroxytryptamine receptor 2A
Name:5-hydroxytryptamine receptor 2A
Type:G Protein-Coupled Receptor (GPCR)
Mol. Mass.:52852.05
Organism:Rattus norvegicus (rat)
Description:Rat cortex membranes 5-HT2A receptors.
Residue:471
BDBM50004918
NameBDBM50004918
Synonyms:(+/-)-APD3-Allyl-1-phenyl-2,3,4,5-tetrahydro-1H-benzo[d]azepine-7,8-diol CHEMBL288090 SKF 77434
TypeSmall organic molecule
Emp. Form.C19H21NO2
Mol. Mass.295.3755
SMILESOc1cc2CCN(CC=C)CC(c3ccccc3)c2cc1O