Reaction Details
Target5-hydroxytryptamine receptor 2C
LigandBDBM50007518
Substrate/Competitorn/a
Ki>10000±n/a nM
CommentsPDSP_803
Citation Toll, LBerzetei-Gurske, IPPolgar, WEBrandt, SRAdapa, IDRodriguez, LSchwartz, RWHaggart, DO'Brien, AWhite, AKennedy, JMCraymer, KFarrington, LAuh, JS Standard binding and functional assays related to medications development division testing for potential cocaine and opiate narcotic treatment medications. NIDA Res Monogr178:440-66 (1998) 5-hydroxytryptamine receptor 2C
Name:5-hydroxytryptamine receptor 2C
Type:Enzyme
Mol. Mass.:51935.10
Organism:Rattus norvegicus (Rat)
Description:P08909
Residue:460
BDBM50007518
NameBDBM50007518
Synonyms:(S)-3-chloro-5-ethyl-N-((1-ethylpyrrolidin-2-yl)methyl)-6-hydroxy-2-methoxybenzamide 3-Chloro-5-ethyl-N-((S)-1-ethyl-pyrrolidin-2-ylmethyl)-6-hydroxy-2-methoxy-benzamide 3-Chloro-5-ethyl-N-(1-ethyl-pyrrolidin-2-ylmethyl)-6-hydroxy-2-methoxy-benzamide (etichlopride) 3-chloro-5-ethyl-N-{[(2S)-1-ethylpyrrolidin-2-yl]methyl}-6-hydroxy-2-methoxybenzamide ETICLOPRIDE Eticlopride;3-Chloro-5-ethyl-N-(1-ethyl-pyrrolidin-2-ylmethyl)-6-hydroxy-2-methoxy-benzamide
TypeSmall organic molecule
Emp. Form.C17H25ClN2O3
Mol. Mass.340.845
SMILESCCN1CCC[C@H]1CNC(=O)c1c(O)c(CC)cc(Cl)c1OC