Reaction Details
TargetD(1A) dopamine receptor
LigandBDBM50241143
Substrate/Competitorn/a
Ki>10000±n/a nM
CommentsPDSP_1179
Citation Toll, LBerzetei-Gurske, IPPolgar, WEBrandt, SRAdapa, IDRodriguez, LSchwartz, RWHaggart, DO'Brien, AWhite, AKennedy, JMCraymer, KFarrington, LAuh, JS Standard binding and functional assays related to medications development division testing for potential cocaine and opiate narcotic treatment medications. NIDA Res Monogr178:440-66 (1998) D(1A) dopamine receptor
Name:D(1A) dopamine receptor
Type:Enzyme
Mol. Mass.:49303.43
Organism:Homo sapiens (Human)
Description:P21728
Residue:446
BDBM50241143
NameBDBM50241143
Synonyms:(MDL 72222)3,5-Dichloro-benzoic acid 8-methyl-8-aza-bicyclo[3.2.1]oct-3-yl ester 3,5-Dichloro-benzoic acid 8-methyl-8-aza-bicyclo[3.2.1]oct-3-yl ester (MDL 72222) 3,5-Dichloro-benzoic acid 8-methyl-8-aza-bicyclo[3.2.1]oct-3-yl ester(MDL-72222) 3alpha-(3',5'-dichlorobenzoyloxy)tropane MDL 72222 [2-(5-Hydroxy-1H-indol-3-yl)-ethyl]-trimethyl-ammonium
TypeSmall organic molecule
Emp. Form.C15H17Cl2NO2
Mol. Mass.314.207
SMILESCN1C2CCC1CC(C2)OC(=O)c1cc(Cl)cc(Cl)c1