Reaction Details
TargetDelta-type opioid receptor
LigandBDBM50013388
Substrate/Competitorn/a
Ki 0.3±n/a nM
CommentsPDSP_414
Citation Toll, LBerzetei-Gurske, IPPolgar, WEBrandt, SRAdapa, IDRodriguez, LSchwartz, RWHaggart, DO'Brien, AWhite, AKennedy, JMCraymer, KFarrington, LAuh, JS Standard binding and functional assays related to medications development division testing for potential cocaine and opiate narcotic treatment medications. NIDA Res Monogr178:440-66 (1998) Delta-type opioid receptor
Name:Delta-type opioid receptor
Type:Enzyme Catalytic Domain
Mol. Mass.:25736.90
Organism:GUINEA PIG
Description:OPIATE Delta OPRD1 GUINEA PIG::P79291
Residue:228
BDBM50013388
NameBDBM50013388
Synonyms:6-Ethyl-3-(1-hydroxy-cyclopropylmethyl)-11,11-dimethyl-1,2,3,4,5,6-hexahydro-2,6-methano-benzo[d]azocin-8-ol Bremazocine | CHEMBL350384
TypeSmall organic molecule
Emp. Form.C20H29NO2
Mol. Mass.315.4498
SMILESCCC12CCN(CC3(O)CC3)C(Cc3ccc(O)cc13)C2(C)C