Reaction Details
TargetDelta-type opioid receptor
LigandBDBM85326
Substrate/Competitorn/a
Ki 2.6±n/a nM
CommentsPDSP_1279
Citation Toll, LBerzetei-Gurske, IPPolgar, WEBrandt, SRAdapa, IDRodriguez, LSchwartz, RWHaggart, DO'Brien, AWhite, AKennedy, JMCraymer, KFarrington, LAuh, JS Standard binding and functional assays related to medications development division testing for potential cocaine and opiate narcotic treatment medications. NIDA Res Monogr178:440-66 (1998) Delta-type opioid receptor
Name:Delta-type opioid receptor
Type:Enzyme Catalytic Domain
Mol. Mass.:25736.90
Organism:GUINEA PIG
Description:OPIATE Delta OPRD1 GUINEA PIG::P79291
Residue:228
BDBM85326
NameBDBM85326
Synonyms:CAS_119501 NSC_119501 | nalmefene
TypeSmall organic molecule
Emp. Form.C21H25NO3
Mol. Mass.339.4281
SMILESOc1ccc2CC3N(CC4CC4)CCC45C(Oc1c24)C(=C)CCC35O