Reaction Details
TargetDelta-type opioid receptor
LigandBDBM50169774
Substrate/Competitorn/a
Ki>10000±n/a nM
CommentsPDSP_1935
Citation Toll, LBerzetei-Gurske, IPPolgar, WEBrandt, SRAdapa, IDRodriguez, LSchwartz, RWHaggart, DO'Brien, AWhite, AKennedy, JMCraymer, KFarrington, LAuh, JS Standard binding and functional assays related to medications development division testing for potential cocaine and opiate narcotic treatment medications. NIDA Res Monogr178:440-66 (1998) Delta-type opioid receptor
Name:Delta-type opioid receptor
Type:Enzyme Catalytic Domain
Mol. Mass.:25736.90
Organism:GUINEA PIG
Description:OPIATE Delta OPRD1 GUINEA PIG::P79291
Residue:228
BDBM50169774
NameBDBM50169774
Synonyms:2-(3,4-Dichloro-phenyl)-N-methyl-N-(2-pyrrolidin-1-yl-cyclohexyl)-acetamide; compound with methanesulfonic acid U-50488H | U50,488H
TypeSmall organic molecule
Emp. Form.C19H26Cl2N2O
Mol. Mass.369.329
SMILESCN(C1CCCC[C@H]1N1CCCC1)C(=O)Cc1ccc(Cl)c(Cl)c1