Reaction Details
TargetKappa-type opioid receptor
LigandBDBM21025
Substrate/Competitorn/a
Ki>10000±n/a nM
CommentsPDSP_615
Citation Toll, LBerzetei-Gurske, IPPolgar, WEBrandt, SRAdapa, IDRodriguez, LSchwartz, RWHaggart, DO'Brien, AWhite, AKennedy, JMCraymer, KFarrington, LAuh, JS Standard binding and functional assays related to medications development division testing for potential cocaine and opiate narcotic treatment medications. NIDA Res Monogr178:440-66 (1998) Kappa-type opioid receptor
Name:Kappa-type opioid receptor
Type:G Protein-Coupled Receptor (GPCR)
Mol. Mass.:42648.76
Organism:Homo sapiens (Human)
Description:P41145
Residue:380
BDBM21025
NameBDBM21025
Synonyms:(2R)-2-[(2S)-2-{2-[(2R)-2-[(2S)-2-amino-3-(4-hydroxyphenyl)propanamido]propanamido]acetamido}-3-phenylpropanamido]-4-methylpentanoic acid BW-180C DADLE H-Tyr-D-Ala-Gly-Phe-D-Leu-OH | [D-Ala2-D-Leu5]enkephalin
TypeANALGESIC
Emp. Form.C29H39N5O7
Mol. Mass.569.6493
SMILESCC(C)C[C@@H](NC(=O)[C@H](Cc1ccccc1)NC(=O)CNC(=O)[C@@H](C)NC(=O)[C@@H](N)Cc1ccc(O)cc1)C(O)=O