Reaction Details
TargetKappa-type opioid receptor
LigandBDBM50000091
Substrate/Competitorn/a
Ki 0.1±n/a nM
CommentsPDSP_777
Citation Toll, LBerzetei-Gurske, IPPolgar, WEBrandt, SRAdapa, IDRodriguez, LSchwartz, RWHaggart, DO'Brien, AWhite, AKennedy, JMCraymer, KFarrington, LAuh, JS Standard binding and functional assays related to medications development division testing for potential cocaine and opiate narcotic treatment medications. NIDA Res Monogr178:440-66 (1998) Kappa-type opioid receptor
Name:Kappa-type opioid receptor
Type:G Protein-Coupled Receptor (GPCR)
Mol. Mass.:42648.76
Organism:Homo sapiens (Human)
Description:P41145
Residue:380
BDBM50000091
NameBDBM50000091
Synonyms:(6S,11R)-3-Cyclopropylmethyl-6-ethyl-8-hydroxy-11-methyl-3,4,5,6-tetrahydro-2H-2,6-methano-benzo[d]azocin-1-one 3-Cyclopropylmethyl-6-ethyl-8-hydroxy-11-methyl-3,4,5,6-tetrahydro-2H-2,6-methano-benzo[d]azocin-1-one 3-Cyclopropylmethyl-6-ethyl-8-hydroxy-11-methyl-3,4,5,6-tetrahydro-2H-2,6-methano-benzo[d]azocin-1-one(Ethylketazocine, EKC) EKC | EKC(-)
TypeSmall organic molecule
Emp. Form.C19H25NO2
Mol. Mass.299.4073
SMILESCC[C@]12CCN(CC3CC3)C([C@@H]1C)C(=O)c1ccc(O)cc21