Reaction Details
TargetKappa-type opioid receptor
LigandBDBM82507
Substrate/Competitorn/a
Ki 323.5±n/a nM
CommentsPDSP_1
Citation Toll, LBerzetei-Gurske, IPPolgar, WEBrandt, SRAdapa, IDRodriguez, LSchwartz, RWHaggart, DO'Brien, AWhite, AKennedy, JMCraymer, KFarrington, LAuh, JS Standard binding and functional assays related to medications development division testing for potential cocaine and opiate narcotic treatment medications. NIDA Res Monogr178:440-66 (1998) Kappa-type opioid receptor
Name:Kappa-type opioid receptor
Type:G Protein-Coupled Receptor (GPCR)
Mol. Mass.:42648.76
Organism:Homo sapiens (Human)
Description:P41145
Residue:380
BDBM82507
NameBDBM82507
Synonyms:(+/-)-Methadone METHADONE NSC_22266
TypeSmall organic molecule
Emp. Form.C21H27NO
Mol. Mass.309.4452
SMILESCCC(=O)C(CC(C)N(C)C)(c1ccccc1)c1ccccc1