Reaction Details
TargetMu-type opioid receptor
LigandBDBM82553
Substrate/Competitorn/a
Ki 0.3±n/a nM
CommentsPDSP_362
Citation Toll, LBerzetei-Gurske, IPPolgar, WEBrandt, SRAdapa, IDRodriguez, LSchwartz, RWHaggart, DO'Brien, AWhite, AKennedy, JMCraymer, KFarrington, LAuh, JS Standard binding and functional assays related to medications development division testing for potential cocaine and opiate narcotic treatment medications. NIDA Res Monogr178:440-66 (1998) Mu-type opioid receptor
Name:Mu-type opioid receptor
Type:G Protein-Coupled Receptor (GPCR)
Mol. Mass.:44789.51
Organism:Homo sapiens (Human)
Description:P35372
Residue:400
BDBM82553
NameBDBM82553
Synonyms:BETA-FUNALTREXAMINE b-FNA-HCl
TypeSmall organic molecule
Emp. Form.C25H30N2O6
Mol. Mass.454.5155
SMILESCOC(=O)\C=C\C(=O)NC1CC[C@]2(O)[C@H]3Cc4ccc(O)c5O[C@@H]1[C@]2(CCN3CC1CC1)c45