Reaction Details
TargetMu-type opioid receptor
LigandBDBM50013847
Substrate/Competitorn/a
Ki 1.6±n/a nM
CommentsPDSP_804
Citation Toll, LBerzetei-Gurske, IPPolgar, WEBrandt, SRAdapa, IDRodriguez, LSchwartz, RWHaggart, DO'Brien, AWhite, AKennedy, JMCraymer, KFarrington, LAuh, JS Standard binding and functional assays related to medications development division testing for potential cocaine and opiate narcotic treatment medications. NIDA Res Monogr178:440-66 (1998) Mu-type opioid receptor
Name:Mu-type opioid receptor
Type:Enzyme Catalytic Domain
Mol. Mass.:11165.58
Organism:GUINEA PIG
Description:P97266
Residue:98
BDBM50013847
NameBDBM50013847
Synonyms:CHEMBL312040 {2-[2-(4-Ethoxy-benzyl)-5-nitro-benzoimidazol-1-yl]-ethyl}-diethyl-amine
TypeSmall organic molecule
Emp. Form.C22H28N4O3
Mol. Mass.396.4827
SMILESCCOc1ccc(Cc2nc3cc(ccc3n2CCN(CC)CC)[N+]([O-])=O)cc1