Reaction Details
TargetMu-type opioid receptor
LigandBDBM82425
Substrate/Competitorn/a
Ki 0.3±n/a nM
CommentsPDSP_806
Citation Toll, LBerzetei-Gurske, IPPolgar, WEBrandt, SRAdapa, IDRodriguez, LSchwartz, RWHaggart, DO'Brien, AWhite, AKennedy, JMCraymer, KFarrington, LAuh, JS Standard binding and functional assays related to medications development division testing for potential cocaine and opiate narcotic treatment medications. NIDA Res Monogr178:440-66 (1998) Mu-type opioid receptor
Name:Mu-type opioid receptor
Type:G Protein-Coupled Receptor (GPCR)
Mol. Mass.:44789.51
Organism:Homo sapiens (Human)
Description:P35372
Residue:400
BDBM82425
NameBDBM82425
Synonyms:CAS_61677 NSC_61677
TypeSmall organic molecule
Emp. Form.C25H33NO4
Mol. Mass.411.5338
SMILESCCCC(C)(O)C1CC23C=CC1(OC)C1Oc4c5c(CC2N(C)CCC315)ccc4O