Reaction Details
TargetMu-type opioid receptor
LigandBDBM82551
Substrate/Competitorn/a
Ki 21±n/a nM
CommentsPDSP_1352
Citation Toll, LBerzetei-Gurske, IPPolgar, WEBrandt, SRAdapa, IDRodriguez, LSchwartz, RWHaggart, DO'Brien, AWhite, AKennedy, JMCraymer, KFarrington, LAuh, JS Standard binding and functional assays related to medications development division testing for potential cocaine and opiate narcotic treatment medications. NIDA Res Monogr178:440-66 (1998) Mu-type opioid receptor
Name:Mu-type opioid receptor
Type:G Protein-Coupled Receptor (GPCR)
Mol. Mass.:44789.51
Organism:Homo sapiens (Human)
Description:P35372
Residue:400
BDBM82551
NameBDBM82551
Synonyms:C18130 NOR-BNI (HCI)2 | NORBNI
TypeSmall organic molecule
Emp. Form.C40H43N3O6
Mol. Mass.661.7859
SMILESOc1ccc2C[C@H]3N(CC4CC4)CC[C@@]45[C@@H](Oc1c24)c1[nH]c2[C@@H]4Oc6c7c(C[C@H]8N(CC9CC9)CC[C@@]47[C@@]8(O)Cc2c1C[C@@]35O)ccc6O