Reaction Details
TargetMu-type opioid receptor
LigandBDBM50169774
Substrate/Competitorn/a
Ki 290±n/a nM
CommentsPDSP_1935
Citation Toll, LBerzetei-Gurske, IPPolgar, WEBrandt, SRAdapa, IDRodriguez, LSchwartz, RWHaggart, DO'Brien, AWhite, AKennedy, JMCraymer, KFarrington, LAuh, JS Standard binding and functional assays related to medications development division testing for potential cocaine and opiate narcotic treatment medications. NIDA Res Monogr178:440-66 (1998) Mu-type opioid receptor
Name:Mu-type opioid receptor
Type:G Protein-Coupled Receptor (GPCR)
Mol. Mass.:44789.51
Organism:Homo sapiens (Human)
Description:P35372
Residue:400
BDBM50169774
NameBDBM50169774
Synonyms:2-(3,4-Dichloro-phenyl)-N-methyl-N-(2-pyrrolidin-1-yl-cyclohexyl)-acetamide; compound with methanesulfonic acid U-50488H | U50,488H
TypeSmall organic molecule
Emp. Form.C19H26Cl2N2O
Mol. Mass.369.329
SMILESCN(C1CCCC[C@H]1N1CCCC1)C(=O)Cc1ccc(Cl)c(Cl)c1