Reaction Details
TargetNeuronal acetylcholine receptor subunit alpha-3
LigandBDBM50061565
Substrate/Competitorn/a
Ki>10000±n/a nM
CommentsPDSP_1187
Citation Xiao, YMeyer, ELThompson, JMSurin, AWroblewski, JKellar, KJ Rat alpha3/beta4 subtype of neuronal nicotinic acetylcholine receptor stably expressed in a transfected cell line: pharmacology of ligand binding and function. Mol Pharmacol54:322-33 (1998) 
 
Neuronal acetylcholine receptor subunit alpha-3
Name:Neuronal acetylcholine receptor subunit alpha-3
Type:Enzyme
Mol. Mass.:56995.52
Organism:Rattus norvegicus (Rat)
Description:P04757
Residue:499
BDBM50061565
NameBDBM50061565
Synonyms:(+)Methyl-(2,3,3-trimethyl-bicyclo[2.2.1]hept-2-yl)-amine (-)Methyl-(2,3,3-trimethyl-bicyclo[2.2.1]hept-2-yl)-amine MECAMYLAMINE Methyl-(2,3,3-trimethyl-bicyclo[2.2.1]hept-2-yl)-amine(Mecamylamine)
TypeSmall organic molecule
Emp. Form.C11H21N
Mol. Mass.167.2911
SMILESCNC1(C)C2CCC(C2)C1(C)C