Reaction Details
TargetNicotinic acetylcholine receptor
LigandBDBM10759
Substrate/Competitorn/a
Ki 32.8±n/a nM
CommentsPDSP_229
Citation Xiao, YMeyer, ELThompson, JMSurin, AWroblewski, JKellar, KJ Rat alpha3/beta4 subtype of neuronal nicotinic acetylcholine receptor stably expressed in a transfected cell line: pharmacology of ligand binding and function. Mol Pharmacol54:322-33 (1998) 
 
Nicotinic acetylcholine receptor
Name:Nicotinic acetylcholine receptor
Type:Enzyme Catalytic Domain
Mol. Mass.:2478.99
Organism:RAT
Description:n-AChR 0 RAT::Q62594
Residue:23
BDBM10759
NameBDBM10759
Synonyms:2-acetoxyethyl(trimethyl)ammonium;bromide CHEMBL667 [2-(acetyloxy)ethyl]trimethylazanium acetylcholine chloride | cid_6060
TypeSmall Organic Molecule
Emp. Form.C7H16NO2
Mol. Mass.146.2069
SMILESCC(=O)OCC[N+](C)(C)C