Reaction Details
TargetNicotinic acetylcholine receptor
LigandBDBM50023330
Substrate/Competitorn/a
Ki 6.51±n/a nM
CommentsPDSP_303
Citation Xiao, YMeyer, ELThompson, JMSurin, AWroblewski, JKellar, KJ Rat alpha3/beta4 subtype of neuronal nicotinic acetylcholine receptor stably expressed in a transfected cell line: pharmacology of ligand binding and function. Mol Pharmacol54:322-33 (1998) 
 
Nicotinic acetylcholine receptor
Name:Nicotinic acetylcholine receptor
Type:Enzyme Catalytic Domain
Mol. Mass.:2478.99
Organism:RAT
Description:n-AChR 0 RAT::Q62594
Residue:23
BDBM50023330
NameBDBM50023330
Synonyms:1-(9-Aza-bicyclo[4.2.1]non-2-en-2-yl)-ethanone Anatoxin-A,(+) CHEMBL25619
TypeSmall organic molecule
Emp. Form.C10H15NO
Mol. Mass.165.2322
SMILESCC(=O)C1=CCCC2CCC1N2