Reaction Details
TargetNicotinic acetylcholine receptor
LigandBDBM81458
Substrate/Competitorn/a
Ki 2237±n/a nM
CommentsPDSP_761
Citation Xiao, YMeyer, ELThompson, JMSurin, AWroblewski, JKellar, KJ Rat alpha3/beta4 subtype of neuronal nicotinic acetylcholine receptor stably expressed in a transfected cell line: pharmacology of ligand binding and function. Mol Pharmacol54:322-33 (1998) 
 
Nicotinic acetylcholine receptor
Name:Nicotinic acetylcholine receptor
Type:Enzyme Catalytic Domain
Mol. Mass.:2478.99
Organism:RAT
Description:n-AChR 0 RAT::Q62594
Residue:23
BDBM81458
NameBDBM81458
Synonyms:CAS_57-94-3 d-Tubocurarine
TypeSmall organic molecule
Emp. Form.C37H41N2O6
Mol. Mass.609.7307
SMILESCOc1cc2CC[N+](C)(C)C3Cc4ccc(O)c(Oc5cc6C(Cc7ccc(Oc(c1O)c23)cc7)N(C)CCc6cc5OC)c4