Reaction Details
TargetMu-type opioid receptor
LigandBDBM50095150
Substrate/Competitorn/a
Ki 0.24±n/a nM
CommentsPDSP_780
Citation Goldberg, IERossi, GCLetchworth, SRMathis, JPRyan-Moro, JLeventhal, LSu, WEmmel, DBolan, EAPasternak, GW Pharmacological characterization of endomorphin-1 and endomorphin-2 in mouse brain. J Pharmacol Exp Ther286:1007-13 (1998) Mu-type opioid receptor
Name:Mu-type opioid receptor
Type:G Protein-Coupled Receptor (GPCR)
Mol. Mass.:44503.11
Organism:Rattus norvegicus (rat)
Description:Competition binding assays were carried out using membrane preparations from transfected HN9.10 cells that constitutively expressed the mu opioid receptor.
Residue:398
BDBM50095150
NameBDBM50095150
Synonyms:(R)-1-[(S)-2-Amino-3-(4-hydroxy-phenyl)-propionyl]-pyrrolidine-2-carboxylic acid [(S)-1-((S)-1-carbamoyl-2-phenyl-ethylcarbamoyl)-2-(1H-indol-3-yl)-ethyl]-amide Endomorphin 1
TypeSmall organic molecule
Emp. Form.C34H38N6O5
Mol. Mass.610.7027
SMILESN[C@@H](Cc1ccc(O)cc1)C(=O)N1CCC[C@@H]1C(=O)N[C@@H](Cc1c[nH]c2ccccc12)C(=O)N[C@@H](Cc1ccccc1)C(N)=O