Reaction Details
TargetMu-type opioid receptor
LigandBDBM50125682
Substrate/Competitorn/a
Ki 2.35±n/a nM
CommentsPDSP_1251
Citation Goldberg, IERossi, GCLetchworth, SRMathis, JPRyan-Moro, JLeventhal, LSu, WEmmel, DBolan, EAPasternak, GW Pharmacological characterization of endomorphin-1 and endomorphin-2 in mouse brain. J Pharmacol Exp Ther286:1007-13 (1998) Mu-type opioid receptor
Name:Mu-type opioid receptor
Type:Enzyme Catalytic Domain
Mol. Mass.:44431.62
Organism:MOUSE
Description:OPIATE Mu OPRM1 MOUSE::P42866
Residue:398
BDBM50125682
NameBDBM50125682
Synonyms:3,4,5-trihydroxy-6-[10-hydroxy-4-methyl-(5R,13R,14S,17R)-12-oxa-4-azapentacyclo[9.6.1.01,13.05,17.07,18]octadeca-7(18),8,10,15-tetraen-14-yloxy]tetrahydro-2H-2-pyrancarboxylic acid Morphine 6-glucuronide
TypeSmall organic molecule
Emp. Form.C23H27NO9
Mol. Mass.461.4618
SMILESCN1CCC23[C@H]4Oc5c2c(C[C@@H]1[C@@H]3C=C[C@@H]4OC1OC(C(O)C(O)C1O)C(O)=O)ccc5O