Reaction Details
TargetProstaglandin E2 receptor EP3 subtype
LigandBDBM82094
Substrate/Competitorn/a
Ki 7±n/a nM
CommentsPDSP_1464
Citation Sharif, NAXu, SXWilliams, GWCrider, JYGriffin, BWDavis, TL Pharmacology of [3H]prostaglandin E1/[3H]prostaglandin E2 and [3H]prostaglandin F2alpha binding to EP3 and FP prostaglandin receptor binding sites in bovine corpus luteum: characterization and correlation with functional data. J Pharmacol Exp Ther286:1094-102 (1998) Prostaglandin E2 receptor EP3 subtype
Name:Prostaglandin E2 receptor EP3 subtype
Type:Enzyme Catalytic Domain
Mol. Mass.:46379.75
Organism:BOVINE
Description:Prostaglandin E3 PTGER3 BOVINE::P34979
Residue:417
BDBM82094
NameBDBM82094
Synonyms:17-PHENYL TRINOR PROSTAGLANDIN E2 PGE2,17-Phenyl
TypeSmall organic molecule
Emp. Form.C23H30O5
Mol. Mass.386.4813
SMILESO[C@@H](CCc1ccccc1)\C=C\[C@H]1[C@H](O)CC(=O)[C@@H]1C\C=C/CCCC(O)=O