Reaction Details
TargetProstaglandin F2-alpha receptor
LigandBDBM50018531
Substrate/Competitorn/a
Ki 8900±n/a nM
CommentsPDSP_1934
Citation Sharif, NAXu, SXWilliams, GWCrider, JYGriffin, BWDavis, TL Pharmacology of [3H]prostaglandin E1/[3H]prostaglandin E2 and [3H]prostaglandin F2alpha binding to EP3 and FP prostaglandin receptor binding sites in bovine corpus luteum: characterization and correlation with functional data. J Pharmacol Exp Ther286:1094-102 (1998) Prostaglandin F2-alpha receptor
Name:Prostaglandin F2-alpha receptor
Type:Enzyme Catalytic Domain
Mol. Mass.:41044.75
Organism:BOVINE
Description:ProstaglandinF2Alpha PTGFR BOVINE::P37289
Residue:362
BDBM50018531
NameBDBM50018531
Synonyms:(Z)-7-[(S)-6-((E)-(S)-3-Hydroxy-oct-1-enyl)-2-oxa-bicyclo[2.2.1]hept-5-yl]-hept-5-enoic acid CHEMBL73010 U46619
TypeSmall organic molecule
Emp. Form.C21H34O4
Mol. Mass.350.4923
SMILESCCCCC[C@H](O)\C=C\C1[C@H]2C[C@H](CO2)[C@@H]1C\C=C/CCCC(O)=O