Reaction Details
TargetProstaglandin F2-alpha receptor
LigandBDBM85345
Substrate/Competitorn/a
Ki 5900±n/a nM
CommentsPDSP_1940
Citation Sharif, NAXu, SXWilliams, GWCrider, JYGriffin, BWDavis, TL Pharmacology of [3H]prostaglandin E1/[3H]prostaglandin E2 and [3H]prostaglandin F2alpha binding to EP3 and FP prostaglandin receptor binding sites in bovine corpus luteum: characterization and correlation with functional data. J Pharmacol Exp Ther286:1094-102 (1998) Prostaglandin F2-alpha receptor
Name:Prostaglandin F2-alpha receptor
Type:Enzyme Catalytic Domain
Mol. Mass.:41044.75
Organism:BOVINE
Description:ProstaglandinF2Alpha PTGFR BOVINE::P37289
Residue:362
BDBM85345
NameBDBM85345
Synonyms:CAS_151671 UF-021
TypeSmall organic molecule
Emp. Form.C25H44O5
Mol. Mass.424.6139
SMILESCCCCCCCC(=O)CCC1C(O)CC(O)C1CC=CCCCC(=O)OC(C)C