Reaction Details
TargetMu-type opioid receptor
LigandBDBM50016847
Substrate/Competitorn/a
Ki 7.23±n/a nM
CommentsPDSP_4621
Citation Spetea, MOtvös, FTóth, GNguyen, TMSchiller, PWVogel, ZBorsodi, A Interaction of agonist peptide [3H]Tyr-D-Ala-Phe-Phe-NH2 with mu-opioid receptor in rat brain and CHO-mu/1 cell line. Peptides19:1091-8 (1998) 
 
Mu-type opioid receptor
Name:Mu-type opioid receptor
Type:G Protein-Coupled Receptor (GPCR)
Mol. Mass.:44503.11
Organism:Rattus norvegicus (rat)
Description:Competition binding assays were carried out using membrane preparations from transfected HN9.10 cells that constitutively expressed the mu opioid receptor.
Residue:398
BDBM50016847
NameBDBM50016847
Synonyms:CHEMBL337041 | Cyprodime
TypeSmall organic molecule
Emp. Form.C22H29NO3
Mol. Mass.355.4706
SMILESCOc1cccc2CC3N(CC4CC4)CC[C@@]4(CC(=O)CC[C@@]34OC)c12