Reaction Details
TargetMu-type opioid receptor
LigandBDBM50003571
Substrate/Competitorn/a
Ki 0.38±n/a nM
CommentsPDSP_2935
Citation Spetea, MOtvös, FTóth, GNguyen, TMSchiller, PWVogel, ZBorsodi, A Interaction of agonist peptide [3H]Tyr-D-Ala-Phe-Phe-NH2 with mu-opioid receptor in rat brain and CHO-mu/1 cell line. Peptides19:1091-8 (1998) 
 
Mu-type opioid receptor
Name:Mu-type opioid receptor
Type:G Protein-Coupled Receptor (GPCR)
Mol. Mass.:44503.11
Organism:Rattus norvegicus (rat)
Description:Competition binding assays were carried out using membrane preparations from transfected HN9.10 cells that constitutively expressed the mu opioid receptor.
Residue:398
BDBM50003571
NameBDBM50003571
Synonyms:(-)-3-Hydroxy-N-methylmorphinan hydrochloride (levorphanol) 17-methyl-17-azatetracyclo[7.5.3.0^{1,10}.0^{2,7}]heptadeca-2(7),3,5-trien-4-ol Levorphanol
TypeSmall organic molecule
Emp. Form.C17H23NO
Mol. Mass.257.3706
SMILESCN1CCC23CCCCC2C1Cc1ccc(O)cc31