Reaction Details
TargetGalanin receptor type 1
LigandBDBM50273370
Substrate/Competitorn/a
Ki 0.32±n/a nM
CommentsPDSP_3167
Citation Smith, KEWalker, MWArtymyshyn, RBard, JBorowsky, BTamm, JAYao, WJVaysse, PJBranchek, TAGerald, CJones, KA Cloned human and rat galanin GALR3 receptors. Pharmacology and activation of G-protein inwardly rectifying K+ channels. J Biol Chem273:23321-6 (1998) 
 
Galanin receptor type 1
Name:Galanin receptor type 1
Type:Enzyme Catalytic Domain
Mol. Mass.:38883.91
Organism:RAT
Description:Galanin R1 GALR1 RAT::Q62805
Residue:346
BDBM50273370
NameBDBM50273370
Synonyms:CHEMBL503473 Galanin (1-13)-bradikinin(2-9) M35
TypeSmall organic molecule
Emp. Form.C107H153N27O26
Mol. Mass.2233.525
SMILESCC(C)C[C@H](NC(=O)[C@H](CC(C)C)NC(=O)[C@H](Cc1ccc(O)cc1)NC(=O)CNC(=O)[C@H](C)NC(=O)[C@H](CO)NC(=O)[C@H](CC(N)=O)NC(=O)[C@H](CC(C)C)NC(=O)[C@@H](NC(=O)[C@H](Cc1c[nH]c2ccccc12)NC(=O)CN)[C@@H](C)O)C(=O)NCC(=O)N1CCC[C@H]1C(=O)N1CCC[C@H]1C(=O)N1CCC[C@H]1C(=O)NCC(=O)N[C@@H](Cc1ccccc1)C(=O)N[C@@H](CO)C(=O)N1CCC[C@H]1C(=O)N[C@@H](Cc1ccccc1)C(=O)N[C@@H](CCCN=C(N)N)C(N)=O