Reaction Details
TargetGalanin receptor type 2
LigandBDBM85068
Substrate/Competitorn/a
Ki 0.56±n/a nM
CommentsPDSP_2431
Citation Smith, KEWalker, MWArtymyshyn, RBard, JBorowsky, BTamm, JAYao, WJVaysse, PJBranchek, TAGerald, CJones, KA Cloned human and rat galanin GALR3 receptors. Pharmacology and activation of G-protein inwardly rectifying K+ channels. J Biol Chem273:23321-6 (1998) 
 
Galanin receptor type 2
Name:Galanin receptor type 2
Type:Enzyme Catalytic Domain
Mol. Mass.:40697.04
Organism:RAT
Description:Galanin R2 GALR2 RAT::O08726
Residue:372
BDBM85068
NameBDBM85068
Synonyms:Gal(1-13)-Std I
TypeSmall organic molecule
Emp. Form.C138H199N35O30
Mol. Mass.2828.2732
SMILESCC(C)C[C@H](NC(=O)[C@H](CC(C)C)NC(=O)[C@H](Cc1ccc(O)cc1)NC(=O)CNC(=O)[C@H](C)NC(=O)[C@H](CO)NC(=O)[C@H](CC(N)=O)NC(=O)[C@H](CC(C)C)NC(=O)[C@@H](NC(=O)[C@H](Cc1c[nH]c2ccccc12)NC(=O)CN)[C@@H](C)O)C(=O)NCC(=O)N1CCC[C@H]1C(=O)N[C@H](CCCN=C(N)N)C(=O)N1CCC[C@H]1C(=O)N[C@@H](CCCCN)C(=O)N1CCC[C@H]1C(=O)N[C@@H](CCC(N)=O)C(=O)N[C@@H](CCC(N)=O)C(=O)N[C@H](Cc1c[nH]c2ccccc12)C(=O)NC(=O)[C@H](CC(C)C)NC(=O)[C@H](CC(C)C)NC(=O)[C@@H](Cc1c[nH]c2ccccc12)NC(=O)[C@@H](N)Cc1ccccc1