Reaction Details
TargetGalanin receptor type 3
LigandBDBM85169
Substrate/Competitorn/a
Ki 1000±n/a nM
CommentsPDSP_3183
Citation Smith, KEWalker, MWArtymyshyn, RBard, JBorowsky, BTamm, JAYao, WJVaysse, PJBranchek, TAGerald, CJones, KA Cloned human and rat galanin GALR3 receptors. Pharmacology and activation of G-protein inwardly rectifying K+ channels. J Biol Chem273:23321-6 (1998) 
 
Galanin receptor type 3
Name:Galanin receptor type 3
Type:Enzyme Catalytic Domain
Mol. Mass.:40439.51
Organism:RAT
Description:Galanin R3 GALR3 RAT::O88626
Residue:370
BDBM85169
NameBDBM85169
Synonyms:Galanin (1-29), porcine | Galanin [D-Trp2], porcine
TypeSmall organic molecule
Emp. Form.C144H210N42O39
Mol. Mass.3153.4662
SMILESCCC(C)C(NC(=O)C(C)NC(=O)C(Cc1cnc[nH]1)NC(=O)C1CCCN1C(=O)CNC(=O)C(CC(C)C)NC(=O)C(CC(C)C)NC(=O)C(Cc1ccc(O)cc1)NC(=O)CNC(=O)C(C)NC(=O)C(CO)NC(=O)C(CC(N)=O)NC(=O)C(CC(C)C)NC(=O)C(NC(=O)C(Cc1c[nH]c2ccccc12)NC(=O)CN)C(C)O)C(=O)NC(CC(O)=O)C(=O)NC(CC(N)=O)C(=O)NC(Cc1cnc[nH]1)C(=O)NC(CCCN=C(N)N)C(=O)NC(CO)C(=O)NC(Cc1ccccc1)C(=O)NC(Cc1cnc[nH]1)C(=O)NC(CC(O)=O)C(=O)NC(CCCCN)C(=O)NC(CCc1ccc(O)cc1)C(=O)NCC(=O)NC(CC(C)C)C(N)=O