Reaction Details
TargetPancreatic polypeptide receptor 1
LigandBDBM82282
Substrate/Competitorn/a
Ki 29±n/a nM
CommentsPDSP_1382
Citation Eriksson, HBerglund, MMHolmberg, SKKahl, UGehlert, DRLarhammar, D The cloned guinea pig pancreatic polypeptide receptor Y4 resembles more the human Y4 than does the rat Y4. Regul Pept0:29-37 (1998) 
 
Pancreatic polypeptide receptor 1
Name:Pancreatic polypeptide receptor 1
Type:Enzyme Catalytic Domain
Mol. Mass.:42360.30
Organism:GUINEA PIG
Description:O97505
Residue:375
BDBM82282
NameBDBM82282
Synonyms:NPY13-36 | NPY13-36, porcine
TypeSmall organic molecule
Emp. Form.C135H209N41O36
Mol. Mass.2982.3571
SMILESCC[C@H](C)[C@H](NC(=O)[C@H](Cc1ccc(O)cc1)NC(=O)[C@H](Cc1cnc[nH]1)NC(=O)[C@H](CCCN=C(N)N)NC(=O)[C@H](CC(C)C)NC(=O)[C@H](C)NC(=O)[C@H](CO)NC(=O)[C@H](Cc1ccc(O)cc1)NC(=O)[C@H](Cc1ccc(O)cc1)NC(=O)[C@H](CCCN=C(N)N)NC(=O)[C@H](C)NC(=O)[C@H](CC(C)C)NC(=O)[C@H](CC(O)=O)NC(=O)[C@H](CCC(O)=O)NC(=O)[C@H](C)NC(=O)[C@@H]1CCCN1)C(=O)N[C@@H](CC(N)=O)C(=O)N[C@@H](CC(C)C)C(=O)N[C@@H]([C@@H](C)CC)C(=O)N[C@@H]([C@@H](C)O)C(=O)N[C@@H](CCCN=C(N)N)C(=O)N[C@@H](CCC(N)=O)C(=O)N[C@@H](CCCN=C(N)N)C(=O)N[C@@H](Cc1ccc(O)cc1)C(N)=O