Reaction Details
TargetMetabotropic glutamate receptor 2
LigandBDBM50004863
Substrate/Competitorn/a
Ki 9.33±n/a nM
CommentsPDSP_96
Citation Mutel, VAdam, GChaboz, SKemp, JAKlingelschmidt, AMesser, JWichmann, JWoltering, TRichards, JG Characterization of (2S,2'R,3'R)-2-(2',3'-[3H]-dicarboxycyclopropyl)glycine binding in rat brain. J Neurochem71:2558-64 (1998) 
 
Metabotropic glutamate receptor 2
Name:Metabotropic glutamate receptor 2
Type:Enzyme
Mol. Mass.:95584.88
Organism:Homo sapiens (Human)
Description:Q14416
Residue:872
BDBM50004863
NameBDBM50004863
Synonyms:(+/-)-trans-ACPD (1S,3S)-1-aminocyclopentane-1,3-dicarboxylic acid 1-Amino-cyclopentane-1,3-dicarboxylic acid(cis-(1S,3S)-ACPD) 1R,3S-ACPD CHEMBL29726
TypeSmall organic molecule
Emp. Form.C7H11NO4
Mol. Mass.173.1665
SMILESN[C@]1(CC[C@@H](C1)C(O)=O)C(O)=O